{"text_format":"1","workbook":"xlsx","n_sheets":4,"sheets":["Instructions","Vaccination Record","Data Input","Drop Down Source"],"not_rendered":{"charts":0,"images":9,"macros":1,"external_links":0,"defined_names":6,"comments":0,"pivot_tables":0},"unopened":[],"bounds":{"document_bytes":16777216,"sheet_cells":100000,"rows_first":2000,"rows_last":500,"rows_between":2000,"halvings":0,"cell_chars":16384,"cell_head_chars":4096},"cells_cut":0,"cells_raw":0,"read":"whole","date_system":"1900"}

{"sheet":"Instructions","index":0,"n_rows":59,"n_cols":2,"rows_kept":59,"cut":false,"hidden":false,"merged":[]}
[null,"EXCEL BRUCELLOSIS VACCINATION CERTIFICATE INSTRUCTIONS"]
[]
[null,"When you open this document, you will see three Worksheets labeled “Instructions” (in blue), “Vaccination Record” (in red), and “Data Input” (in green) at the bottom of the screen towards the left side. "]
[]
[null,"Click the                                                      worksheet and complete the top portion. You will not be able to edit protected cells.  "]
[]
[]
[]
[]
[]
[]
[]
[null,"The worksheet generates the certificate number automatically based on your license number and the date of vaccination. "]
[null,"If you vaccinate more than one group of animals in a single day, add an 'A' after the certificate number in the box immediately above 'Vet Lic #'; 'B' for the second certificate, and so on."]
[]
[]
[]
[null,"ADDING ANIMAL DATA"]
[null,"Click on the                                 worksheet to enter your animal information. "]
[]
[]
[null,"Your data entry path has two choices from here! First, you may paste or manually enter animal data into the data columns. Instructions below. If performing an Adult or Booster Vaccination, you will likely have tag info to paste from your reader."]
[]
[null,"If recording an Official Calfhood Vaccination wherein you used sequential tags, the tool will fill out your worksheet for you! Click this button and answer the questions:"]
[]
[]
[]
[]
[]
[null,"If manually filling in data...Fill in Column A, “#”, for each animal"]
[null,"As you type, Autofill* or paste data into this worksheet, it will automatically appear on the Vaccination Record "]
[]
[]
[]
[]
[]
[]
[]
[]
[]
{"$rows_left_out":20}
{"sheet":"Vaccination Record","index":1,"n_rows":330,"n_cols":12,"rows_kept":330,"cut":false,"hidden":false,"merged":[[329,0,333,6],[10,6,12,11],[9,0,9,3],[9,8,9,11],[3,6,8,11],[4,0,4,1],[5,0,7,5],[8,4,8,5],[2,2,3,5],[2,0,3,1],[2,6,2,9],[2,10,2,11],[4,2,4,5],[8,0,8,3],[16,0,17,2],[16,3,17,5],[9,4,9,5],[12,0,12,1],[13,0,13,1],[13,4,13,5],[12,4,12,5],[11,4,11,5],[10,4,10,5],[14,0,15,2],[10,0,10,1],[10,2,10,3],[11,0,11,1],[11,2,11,3],[1,10,1,11],[0,9,0,10],[1,0,1,1],[1,2,1,5],[0,6,0,8],[1,6,1,9]]}
["BRUCELLOSIS VACCINATION RECORD",null,null,null,null,null,"Certificate Number: 83-",null,null,{"$f":"K3&\"-\"&D16&E16&F16","v":"-"}]
["Herd Owner: ",null,null,null,null,null,"Veterinarian Name:     ",null,null,null,"Agree Code:"]
["Herd Address:",null,"\n"]
[null,null,null,null,null,null,"I CERTIFY THAT: (1) I have vaccinated with Strain RB51, tattooed and eartagged or otherwise proprely identified all animals listed hereon as prescribed by the Brucellois UM&R, and recorded all information as prescribed by State regulations, (2) when payment is claimed at program expense in accordance with agreement number below no payment has been or will be received from any other source. "]
["Premises ID #:"]
["CERTIFICATION OF OWNER OR WITNESS\nI CERTIFY THAT: the animals listed hereon were vaccinated and identified for the above named owner. "]
[]
[]
["Owner or Witness Name:",null,null,null,"Date:"]
[null,null,null,null,null,null,"Veterinarian Name:     "]
["Vaccine Used",null,"Expiration Date",null,"Dosage",null,"CERTIFICATION FOR RE-ESTABLISHING VACCINATION STATUS\nIndicate tattoo of animals previously vaccinated in appropriate column.Indicate tattoo of animals previously vaccinated in appropriate column.\n"]
[]
["Serial #",null,"Tattoo",null,"Herd Type:"]
[]
["Date of Vaccination: ",null,null,"(Year)","(Mo)","(Day)"]
[null,null,null,null,null,null,"Date"]
["Total # Vaccinated:",null,null,null,null,null,"CERTIFICATION FOR PAYMENT"]
[]
["#","OFFICIAL ID","AGE (mos)","BREED","SEX","TATTOO","#","OFFICIAL ID","AGE (mos)","BREED","SEX","TATTOO"]
[{"$f":"IF('Data Input'!A2<>\"\",'Data Input'!A2,\"\")","v":""},{"$f":"IF('Data Input'!B2<>\"\",'Data Input'!B2,\"\")","v":""},{"$f":"IF('Data Input'!C2<>\"\",'Data Input'!C2,\"\")","v":""},{"$f":"IF('Data Input'!D2<>\"\",'Data Input'!D2,\"\")","v":""},{"$f":"IF('Data Input'!E2<>\"\",'Data Input'!E2,\"\")","v":""},{"$f":"IF('Data Input'!F2<>\"\",'Data Input'!F2,\"\")","v":""},{"$f":"IF('Data Input'!A35<>\"\",'Data Input'!A35,\"\")","v":""},{"$f":"IF('Data Input'!B35<>\"\",'Data Input'!B35,\"\")","v":""},{"$f":"IF('Data Input'!C35<>\"\",'Data Input'!C35,\"\")","v":""},{"$f":"IF('Data Input'!D35<>\"\",'Data Input'!D35,\"\")","v":""},{"$f":"IF('Data Input'!E35<>\"\",'Data Input'!E35,\"\")","v":""},{"$f":"IF('Data Input'!F35<>\"\",'Data Input'!F35,\"\")","v":""}]
[{"$f":"IF('Data Input'!A3<>\"\",'Data Input'!A3,\"\")","v":""},{"$f":"IF('Data Input'!B3<>\"\",'Data Input'!B3,\"\")","v":""},{"$f":"IF('Data Input'!C3<>\"\",'Data Input'!C3,\"\")","v":""},{"$f":"IF('Data Input'!D3<>\"\",'Data Input'!D3,\"\")","v":""},{"$f":"IF('Data Input'!E3<>\"\",'Data Input'!E3,\"\")","v":""},{"$f":"IF('Data Input'!F3<>\"\",'Data Input'!F3,\"\")","v":""},{"$f":"IF('Data Input'!A36<>\"\",'Data Input'!A36,\"\")","v":""},{"$f":"IF('Data Input'!B36<>\"\",'Data Input'!B36,\"\")","v":""},{"$f":"IF('Data Input'!C36<>\"\",'Data Input'!C36,\"\")","v":""},{"$f":"IF('Data Input'!D36<>\"\",'Data Input'!D36,\"\")","v":""},{"$f":"IF('Data Input'!E36<>\"\",'Data Input'!E36,\"\")","v":""},{"$f":"IF('Data Input'!F36<>\"\",'Data Input'!F36,\"\")","v":""}]
[{"$f":"IF('Data Input'!A4<>\"\",'Data Input'!A4,\"\")","v":""},{"$f":"IF('Data Input'!B4<>\"\",'Data Input'!B4,\"\")","v":""},{"$f":"IF('Data Input'!C4<>\"\",'Data Input'!C4,\"\")","v":""},{"$f":"IF('Data Input'!D4<>\"\",'Data Input'!D4,\"\")","v":""},{"$f":"IF('Data Input'!E4<>\"\",'Data Input'!E4,\"\")","v":""},{"$f":"IF('Data Input'!F4<>\"\",'Data Input'!F4,\"\")","v":""},{"$f":"IF('Data Input'!A37<>\"\",'Data Input'!A37,\"\")","v":""},{"$f":"IF('Data Input'!B37<>\"\",'Data Input'!B37,\"\")","v":""},{"$f":"IF('Data Input'!C37<>\"\",'Data Input'!C37,\"\")","v":""},{"$f":"IF('Data Input'!D37<>\"\",'Data Input'!D37,\"\")","v":""},{"$f":"IF('Data Input'!E37<>\"\",'Data Input'!E37,\"\")","v":""},{"$f":"IF('Data Input'!F37<>\"\",'Data Input'!F37,\"\")","v":""}]
[{"$f":"IF('Data Input'!A5<>\"\",'Data Input'!A5,\"\")","v":""},{"$f":"IF('Data Input'!B5<>\"\",'Data Input'!B5,\"\")","v":""},{"$f":"IF('Data Input'!C5<>\"\",'Data Input'!C5,\"\")","v":""},{"$f":"IF('Data Input'!D5<>\"\",'Data Input'!D5,\"\")","v":""},{"$f":"IF('Data Input'!E5<>\"\",'Data Input'!E5,\"\")","v":""},{"$f":"IF('Data Input'!F5<>\"\",'Data Input'!F5,\"\")","v":""},{"$f":"IF('Data Input'!A38<>\"\",'Data Input'!A38,\"\")","v":""},{"$f":"IF('Data Input'!B38<>\"\",'Data Input'!B38,\"\")","v":""},{"$f":"IF('Data Input'!C38<>\"\",'Data Input'!C38,\"\")","v":""},{"$f":"IF('Data Input'!D38<>\"\",'Data Input'!D38,\"\")","v":""},{"$f":"IF('Data Input'!E38<>\"\",'Data Input'!E38,\"\")","v":""},{"$f":"IF('Data Input'!F38<>\"\",'Data Input'!F38,\"\")","v":""}]
[{"$f":"IF('Data Input'!A6<>\"\",'Data Input'!A6,\"\")","v":""},{"$f":"IF('Data Input'!B6<>\"\",'Data Input'!B6,\"\")","v":""},{"$f":"IF('Data Input'!C6<>\"\",'Data Input'!C6,\"\")","v":""},{"$f":"IF('Data Input'!D6<>\"\",'Data Input'!D6,\"\")","v":""},{"$f":"IF('Data Input'!E6<>\"\",'Data Input'!E6,\"\")","v":""},{"$f":"IF('Data Input'!F6<>\"\",'Data Input'!F6,\"\")","v":""},{"$f":"IF('Data Input'!A39<>\"\",'Data Input'!A39,\"\")","v":""},{"$f":"IF('Data Input'!B39<>\"\",'Data Input'!B39,\"\")","v":""},{"$f":"IF('Data Input'!C39<>\"\",'Data Input'!C39,\"\")","v":""},{"$f":"IF('Data Input'!D39<>\"\",'Data Input'!D39,\"\")","v":""},{"$f":"IF('Data Input'!E39<>\"\",'Data Input'!E39,\"\")","v":""},{"$f":"IF('Data Input'!F39<>\"\",'Data Input'!F39,\"\")","v":""}]
[{"$f":"IF('Data Input'!A7<>\"\",'Data Input'!A7,\"\")","v":""},{"$f":"IF('Data Input'!B7<>\"\",'Data Input'!B7,\"\")","v":""},{"$f":"IF('Data Input'!C7<>\"\",'Data Input'!C7,\"\")","v":""},{"$f":"IF('Data Input'!D7<>\"\",'Data Input'!D7,\"\")","v":""},{"$f":"IF('Data Input'!E7<>\"\",'Data Input'!E7,\"\")","v":""},{"$f":"IF('Data Input'!F7<>\"\",'Data Input'!F7,\"\")","v":""},{"$f":"IF('Data Input'!A40<>\"\",'Data Input'!A40,\"\")","v":""},{"$f":"IF('Data Input'!B40<>\"\",'Data Input'!B40,\"\")","v":""},{"$f":"IF('Data Input'!C40<>\"\",'Data Input'!C40,\"\")","v":""},{"$f":"IF('Data Input'!D40<>\"\",'Data Input'!D40,\"\")","v":""},{"$f":"IF('Data Input'!E40<>\"\",'Data Input'!E40,\"\")","v":""},{"$f":"IF('Data Input'!F40<>\"\",'Data Input'!F40,\"\")","v":""}]
[{"$f":"IF('Data Input'!A8<>\"\",'Data Input'!A8,\"\")","v":""},{"$f":"IF('Data Input'!B8<>\"\",'Data Input'!B8,\"\")","v":""},{"$f":"IF('Data Input'!C8<>\"\",'Data Input'!C8,\"\")","v":""},{"$f":"IF('Data Input'!D8<>\"\",'Data Input'!D8,\"\")","v":""},{"$f":"IF('Data Input'!E8<>\"\",'Data Input'!E8,\"\")","v":""},{"$f":"IF('Data Input'!F8<>\"\",'Data Input'!F8,\"\")","v":""},{"$f":"IF('Data Input'!A41<>\"\",'Data Input'!A41,\"\")","v":""},{"$f":"IF('Data Input'!B41<>\"\",'Data Input'!B41,\"\")","v":""},{"$f":"IF('Data Input'!C41<>\"\",'Data Input'!C41,\"\")","v":""},{"$f":"IF('Data Input'!D41<>\"\",'Data Input'!D41,\"\")","v":""},{"$f":"IF('Data Input'!E41<>\"\",'Data Input'!E41,\"\")","v":""},{"$f":"IF('Data Input'!F41<>\"\",'Data Input'!F41,\"\")","v":""}]
[{"$f":"IF('Data Input'!A9<>\"\",'Data Input'!A9,\"\")","v":""},{"$f":"IF('Data Input'!B9<>\"\",'Data Input'!B9,\"\")","v":""},{"$f":"IF('Data Input'!C9<>\"\",'Data Input'!C9,\"\")","v":""},{"$f":"IF('Data Input'!D9<>\"\",'Data Input'!D9,\"\")","v":""},{"$f":"IF('Data Input'!E9<>\"\",'Data Input'!E9,\"\")","v":""},{"$f":"IF('Data Input'!F9<>\"\",'Data Input'!F9,\"\")","v":""},{"$f":"IF('Data Input'!A42<>\"\",'Data Input'!A42,\"\")","v":""},{"$f":"IF('Data Input'!B42<>\"\",'Data Input'!B42,\"\")","v":""},{"$f":"IF('Data Input'!C42<>\"\",'Data Input'!C42,\"\")","v":""},{"$f":"IF('Data Input'!D42<>\"\",'Data Input'!D42,\"\")","v":""},{"$f":"IF('Data Input'!E42<>\"\",'Data Input'!E42,\"\")","v":""},{"$f":"IF('Data Input'!F42<>\"\",'Data Input'!F42,\"\")","v":""}]
[{"$f":"IF('Data Input'!A10<>\"\",'Data Input'!A10,\"\")","v":""},{"$f":"IF('Data Input'!B10<>\"\",'Data Input'!B10,\"\")","v":""},{"$f":"IF('Data Input'!C10<>\"\",'Data Input'!C10,\"\")","v":""},{"$f":"IF('Data Input'!D10<>\"\",'Data Input'!D10,\"\")","v":""},{"$f":"IF('Data Input'!E10<>\"\",'Data Input'!E10,\"\")","v":""},{"$f":"IF('Data Input'!F10<>\"\",'Data Input'!F10,\"\")","v":""},{"$f":"IF('Data Input'!A43<>\"\",'Data Input'!A43,\"\")","v":""},{"$f":"IF('Data Input'!B43<>\"\",'Data Input'!B43,\"\")","v":""},{"$f":"IF('Data Input'!C43<>\"\",'Data Input'!C43,\"\")","v":""},{"$f":"IF('Data Input'!D43<>\"\",'Data Input'!D43,\"\")","v":""},{"$f":"IF('Data Input'!E43<>\"\",'Data Input'!E43,\"\")","v":""},{"$f":"IF('Data Input'!F43<>\"\",'Data Input'!F43,\"\")","v":""}]
[{"$f":"IF('Data Input'!A11<>\"\",'Data Input'!A11,\"\")","v":""},{"$f":"IF('Data Input'!B11<>\"\",'Data Input'!B11,\"\")","v":""},{"$f":"IF('Data Input'!C11<>\"\",'Data Input'!C11,\"\")","v":""},{"$f":"IF('Data Input'!D11<>\"\",'Data Input'!D11,\"\")","v":""},{"$f":"IF('Data Input'!E11<>\"\",'Data Input'!E11,\"\")","v":""},{"$f":"IF('Data Input'!F11<>\"\",'Data Input'!F11,\"\")","v":""},{"$f":"IF('Data Input'!A44<>\"\",'Data Input'!A44,\"\")","v":""},{"$f":"IF('Data Input'!B44<>\"\",'Data Input'!B44,\"\")","v":""},{"$f":"IF('Data Input'!C44<>\"\",'Data Input'!C44,\"\")","v":""},{"$f":"IF('Data Input'!D44<>\"\",'Data Input'!D44,\"\")","v":""},{"$f":"IF('Data Input'!E44<>\"\",'Data Input'!E44,\"\")","v":""},{"$f":"IF('Data Input'!F44<>\"\",'Data Input'!F44,\"\")","v":""}]
[{"$f":"IF('Data Input'!A12<>\"\",'Data Input'!A12,\"\")","v":""},{"$f":"IF('Data Input'!B12<>\"\",'Data Input'!B12,\"\")","v":""},{"$f":"IF('Data Input'!C12<>\"\",'Data Input'!C12,\"\")","v":""},{"$f":"IF('Data Input'!D12<>\"\",'Data Input'!D12,\"\")","v":""},{"$f":"IF('Data Input'!E12<>\"\",'Data Input'!E12,\"\")","v":""},{"$f":"IF('Data Input'!F12<>\"\",'Data Input'!F12,\"\")","v":""},{"$f":"IF('Data Input'!A45<>\"\",'Data Input'!A45,\"\")","v":""},{"$f":"IF('Data Input'!B45<>\"\",'Data Input'!B45,\"\")","v":""},{"$f":"IF('Data Input'!C45<>\"\",'Data Input'!C45,\"\")","v":""},{"$f":"IF('Data Input'!D45<>\"\",'Data Input'!D45,\"\")","v":""},{"$f":"IF('Data Input'!E45<>\"\",'Data Input'!E45,\"\")","v":""},{"$f":"IF('Data Input'!F45<>\"\",'Data Input'!F45,\"\")","v":""}]
[{"$f":"IF('Data Input'!A13<>\"\",'Data Input'!A13,\"\")","v":""},{"$f":"IF('Data Input'!B13<>\"\",'Data Input'!B13,\"\")","v":""},{"$f":"IF('Data Input'!C13<>\"\",'Data Input'!C13,\"\")","v":""},{"$f":"IF('Data Input'!D13<>\"\",'Data Input'!D13,\"\")","v":""},{"$f":"IF('Data Input'!E13<>\"\",'Data Input'!E13,\"\")","v":""},{"$f":"IF('Data Input'!F13<>\"\",'Data Input'!F13,\"\")","v":""},{"$f":"IF('Data Input'!A46<>\"\",'Data Input'!A46,\"\")","v":""},{"$f":"IF('Data Input'!B46<>\"\",'Data Input'!B46,\"\")","v":""},{"$f":"IF('Data Input'!C46<>\"\",'Data Input'!C46,\"\")","v":""},{"$f":"IF('Data Input'!D46<>\"\",'Data Input'!D46,\"\")","v":""},{"$f":"IF('Data Input'!E46<>\"\",'Data Input'!E46,\"\")","v":""},{"$f":"IF('Data Input'!F46<>\"\",'Data Input'!F46,\"\")","v":""}]
[{"$f":"IF('Data Input'!A14<>\"\",'Data Input'!A14,\"\")","v":""},{"$f":"IF('Data Input'!B14<>\"\",'Data Input'!B14,\"\")","v":""},{"$f":"IF('Data Input'!C14<>\"\",'Data Input'!C14,\"\")","v":""},{"$f":"IF('Data Input'!D14<>\"\",'Data Input'!D14,\"\")","v":""},{"$f":"IF('Data Input'!E14<>\"\",'Data Input'!E14,\"\")","v":""},{"$f":"IF('Data Input'!F14<>\"\",'Data Input'!F14,\"\")","v":""},{"$f":"IF('Data Input'!A47<>\"\",'Data Input'!A47,\"\")","v":""},{"$f":"IF('Data Input'!B47<>\"\",'Data Input'!B47,\"\")","v":""},{"$f":"IF('Data Input'!C47<>\"\",'Data Input'!C47,\"\")","v":""},{"$f":"IF('Data Input'!D47<>\"\",'Data Input'!D47,\"\")","v":""},{"$f":"IF('Data Input'!E47<>\"\",'Data Input'!E47,\"\")","v":""},{"$f":"IF('Data Input'!F47<>\"\",'Data Input'!F47,\"\")","v":""}]
[{"$f":"IF('Data Input'!A15<>\"\",'Data Input'!A15,\"\")","v":""},{"$f":"IF('Data Input'!B15<>\"\",'Data Input'!B15,\"\")","v":""},{"$f":"IF('Data Input'!C15<>\"\",'Data Input'!C15,\"\")","v":""},{"$f":"IF('Data Input'!D15<>\"\",'Data Input'!D15,\"\")","v":""},{"$f":"IF('Data Input'!E15<>\"\",'Data Input'!E15,\"\")","v":""},{"$f":"IF('Data Input'!F15<>\"\",'Data Input'!F15,\"\")","v":""},{"$f":"IF('Data Input'!A48<>\"\",'Data Input'!A48,\"\")","v":""},{"$f":"IF('Data Input'!B48<>\"\",'Data Input'!B48,\"\")","v":""},{"$f":"IF('Data Input'!C48<>\"\",'Data Input'!C48,\"\")","v":""},{"$f":"IF('Data Input'!D48<>\"\",'Data Input'!D48,\"\")","v":""},{"$f":"IF('Data Input'!E48<>\"\",'Data Input'!E48,\"\")","v":""},{"$f":"IF('Data Input'!F48<>\"\",'Data Input'!F48,\"\")","v":""}]
[{"$f":"IF('Data Input'!A16<>\"\",'Data Input'!A16,\"\")","v":""},{"$f":"IF('Data Input'!B16<>\"\",'Data Input'!B16,\"\")","v":""},{"$f":"IF('Data Input'!C16<>\"\",'Data Input'!C16,\"\")","v":""},{"$f":"IF('Data Input'!D16<>\"\",'Data Input'!D16,\"\")","v":""},{"$f":"IF('Data Input'!E16<>\"\",'Data Input'!E16,\"\")","v":""},{"$f":"IF('Data Input'!F16<>\"\",'Data Input'!F16,\"\")","v":""},{"$f":"IF('Data Input'!A49<>\"\",'Data Input'!A49,\"\")","v":""},{"$f":"IF('Data Input'!B49<>\"\",'Data Input'!B49,\"\")","v":""},{"$f":"IF('Data Input'!C49<>\"\",'Data Input'!C49,\"\")","v":""},{"$f":"IF('Data Input'!D49<>\"\",'Data Input'!D49,\"\")","v":""},{"$f":"IF('Data Input'!E49<>\"\",'Data Input'!E49,\"\")","v":""},{"$f":"IF('Data Input'!F49<>\"\",'Data Input'!F49,\"\")","v":""}]
[{"$f":"IF('Data Input'!A17<>\"\",'Data Input'!A17,\"\")","v":""},{"$f":"IF('Data Input'!B17<>\"\",'Data Input'!B17,\"\")","v":""},{"$f":"IF('Data Input'!C17<>\"\",'Data Input'!C17,\"\")","v":""},{"$f":"IF('Data Input'!D17<>\"\",'Data Input'!D17,\"\")","v":""},{"$f":"IF('Data Input'!E17<>\"\",'Data Input'!E17,\"\")","v":""},{"$f":"IF('Data Input'!F17<>\"\",'Data Input'!F17,\"\")","v":""},{"$f":"IF('Data Input'!A50<>\"\",'Data Input'!A50,\"\")","v":""},{"$f":"IF('Data Input'!B50<>\"\",'Data Input'!B50,\"\")","v":""},{"$f":"IF('Data Input'!C50<>\"\",'Data Input'!C50,\"\")","v":""},{"$f":"IF('Data Input'!D50<>\"\",'Data Input'!D50,\"\")","v":""},{"$f":"IF('Data Input'!E50<>\"\",'Data Input'!E50,\"\")","v":""},{"$f":"IF('Data Input'!F50<>\"\",'Data Input'!F50,\"\")","v":""}]
[{"$f":"IF('Data Input'!A18<>\"\",'Data Input'!A18,\"\")","v":""},{"$f":"IF('Data Input'!B18<>\"\",'Data Input'!B18,\"\")","v":""},{"$f":"IF('Data Input'!C18<>\"\",'Data Input'!C18,\"\")","v":""},{"$f":"IF('Data Input'!D18<>\"\",'Data Input'!D18,\"\")","v":""},{"$f":"IF('Data Input'!E18<>\"\",'Data Input'!E18,\"\")","v":""},{"$f":"IF('Data Input'!F18<>\"\",'Data Input'!F18,\"\")","v":""},{"$f":"IF('Data Input'!A51<>\"\",'Data Input'!A51,\"\")","v":""},{"$f":"IF('Data Input'!B51<>\"\",'Data Input'!B51,\"\")","v":""},{"$f":"IF('Data Input'!C51<>\"\",'Data Input'!C51,\"\")","v":""},{"$f":"IF('Data Input'!D51<>\"\",'Data Input'!D51,\"\")","v":""},{"$f":"IF('Data Input'!E51<>\"\",'Data Input'!E51,\"\")","v":""},{"$f":"IF('Data Input'!F51<>\"\",'Data Input'!F51,\"\")","v":""}]
[{"$f":"IF('Data Input'!A19<>\"\",'Data Input'!A19,\"\")","v":""},{"$f":"IF('Data Input'!B19<>\"\",'Data Input'!B19,\"\")","v":""},{"$f":"IF('Data Input'!C19<>\"\",'Data Input'!C19,\"\")","v":""},{"$f":"IF('Data Input'!D19<>\"\",'Data Input'!D19,\"\")","v":""},{"$f":"IF('Data Input'!E19<>\"\",'Data Input'!E19,\"\")","v":""},{"$f":"IF('Data Input'!F19<>\"\",'Data Input'!F19,\"\")","v":""},{"$f":"IF('Data Input'!A52<>\"\",'Data Input'!A52,\"\")","v":""},{"$f":"IF('Data Input'!B52<>\"\",'Data Input'!B52,\"\")","v":""},{"$f":"IF('Data Input'!C52<>\"\",'Data Input'!C52,\"\")","v":""},{"$f":"IF('Data Input'!D52<>\"\",'Data Input'!D52,\"\")","v":""},{"$f":"IF('Data Input'!E52<>\"\",'Data Input'!E52,\"\")","v":""},{"$f":"IF('Data Input'!F52<>\"\",'Data Input'!F52,\"\")","v":""}]
[{"$f":"IF('Data Input'!A20<>\"\",'Data Input'!A20,\"\")","v":""},{"$f":"IF('Data Input'!B20<>\"\",'Data Input'!B20,\"\")","v":""},{"$f":"IF('Data Input'!C20<>\"\",'Data Input'!C20,\"\")","v":""},{"$f":"IF('Data Input'!D20<>\"\",'Data Input'!D20,\"\")","v":""},{"$f":"IF('Data Input'!E20<>\"\",'Data Input'!E20,\"\")","v":""},{"$f":"IF('Data Input'!F20<>\"\",'Data Input'!F20,\"\")","v":""},{"$f":"IF('Data Input'!A53<>\"\",'Data Input'!A53,\"\")","v":""},{"$f":"IF('Data Input'!B53<>\"\",'Data Input'!B53,\"\")","v":""},{"$f":"IF('Data Input'!C53<>\"\",'Data Input'!C53,\"\")","v":""},{"$f":"IF('Data Input'!D53<>\"\",'Data Input'!D53,\"\")","v":""},{"$f":"IF('Data Input'!E53<>\"\",'Data Input'!E53,\"\")","v":""},{"$f":"IF('Data Input'!F53<>\"\",'Data Input'!F53,\"\")","v":""}]
[{"$f":"IF('Data Input'!A21<>\"\",'Data Input'!A21,\"\")","v":""},{"$f":"IF('Data Input'!B21<>\"\",'Data Input'!B21,\"\")","v":""},{"$f":"IF('Data Input'!C21<>\"\",'Data Input'!C21,\"\")","v":""},{"$f":"IF('Data Input'!D21<>\"\",'Data Input'!D21,\"\")","v":""},{"$f":"IF('Data Input'!E21<>\"\",'Data Input'!E21,\"\")","v":""},{"$f":"IF('Data Input'!F21<>\"\",'Data Input'!F21,\"\")","v":""},{"$f":"IF('Data Input'!A54<>\"\",'Data Input'!A54,\"\")","v":""},{"$f":"IF('Data Input'!B54<>\"\",'Data Input'!B54,\"\")","v":""},{"$f":"IF('Data Input'!C54<>\"\",'Data Input'!C54,\"\")","v":""},{"$f":"IF('Data Input'!D54<>\"\",'Data Input'!D54,\"\")","v":""},{"$f":"IF('Data Input'!E54<>\"\",'Data Input'!E54,\"\")","v":""},{"$f":"IF('Data Input'!F54<>\"\",'Data Input'!F54,\"\")","v":""}]
[{"$f":"IF('Data Input'!A22<>\"\",'Data Input'!A22,\"\")","v":""},{"$f":"IF('Data Input'!B22<>\"\",'Data Input'!B22,\"\")","v":""},{"$f":"IF('Data Input'!C22<>\"\",'Data Input'!C22,\"\")","v":""},{"$f":"IF('Data Input'!D22<>\"\",'Data Input'!D22,\"\")","v":""},{"$f":"IF('Data Input'!E22<>\"\",'Data Input'!E22,\"\")","v":""},{"$f":"IF('Data Input'!F22<>\"\",'Data Input'!F22,\"\")","v":""},{"$f":"IF('Data Input'!A55<>\"\",'Data Input'!A55,\"\")","v":""},{"$f":"IF('Data Input'!B55<>\"\",'Data Input'!B55,\"\")","v":""},{"$f":"IF('Data Input'!C55<>\"\",'Data Input'!C55,\"\")","v":""},{"$f":"IF('Data Input'!D55<>\"\",'Data Input'!D55,\"\")","v":""},{"$f":"IF('Data Input'!E55<>\"\",'Data Input'!E55,\"\")","v":""},{"$f":"IF('Data Input'!F55<>\"\",'Data Input'!F55,\"\")","v":""}]
{"$rows_left_out":291}
{"sheet":"Data Input","index":2,"n_rows":622,"n_cols":6,"rows_kept":622,"cut":false,"hidden":false,"merged":[[621,0,622,5]]}
["#","OFFICIAL ID","AGE (mos)","Breed","Sex","Tattoo"]
[]
[]
[]
[]
[]
[]
[]
[]
[]
[]
[]
[]
[]
[]
[]
[]
[]
[]
[]
[]
[]
[]
[]
[]
[]
[]
[]
[]
[]
[]
[]
[]
[]
[]
[]
[]
[]
[]
[]
{"$rows_left_out":583}
{"sheet":"Drop Down Source","index":3,"n_rows":8,"n_cols":1,"rows_kept":8,"cut":false,"hidden":true,"merged":[]}
["(SELECT)"]
["BEEF"]
["DAIRY"]
["MIXED"]
["BISON"]
[]
[]
["Sheet Protection Password: eOCV"]