{"text_format":"1","workbook":"xlsx","n_sheets":4,"sheets":["Instructions","Vaccination Record","Data Input","Drop Down Source"],"not_rendered":{"charts":0,"images":8,"macros":1,"external_links":0,"defined_names":6,"comments":0,"pivot_tables":0},"unopened":[],"bounds":{"document_bytes":16777216,"sheet_cells":100000,"rows_first":2000,"rows_last":500,"rows_between":2000,"halvings":0,"cell_chars":16384,"cell_head_chars":4096},"cells_cut":0,"cells_raw":0,"read":"whole","date_system":"1900"}

{"sheet":"Instructions","index":0,"n_rows":56,"n_cols":2,"rows_kept":56,"cut":false,"hidden":false,"merged":[]}
[null,"EXCEL BRUCELLOSIS VACCINATION CERTIFICATE INSTRUCTIONS"]
[]
[null,"When you open this document, you will see three Worksheets labeled “Instructions” (in blue), “Vaccination Record” (in red), and “Data Input” (in green) at the bottom of the screen towards the left side. "]
[]
[null,"Click the                                                      worksheet and complete the top portion. You will not be able to edit protected cells.  "]
[]
[]
[]
[]
[]
[]
[]
[null,"The worksheet generates the certificate number automatically based on your license number and the date of vaccination. "]
[]
[null,"ADDING ANIMAL DATA"]
[null,"Click on the                                 worksheet to enter your animal information. "]
[]
[]
[null,"Your data entry path has two choices from here! First, you may paste or manually enter animal data into the data columns. Instructions below. If performing an Adult or Booster Vaccination, you will likely have tag info to paste from your reader."]
[]
[null,"Did you use sequential tags for an Official Calfhood Vaccination? This tool can automatically fill out your worksheet. Click the button on the Date Input sheet to start."]
[]
[]
[]
[]
[]
[null,"If manually filling in data...Fill in Column A, “#”, for each animal"]
[null,"As you type, Autofill* or paste data into this worksheet, it will automatically appear on the Vaccination Record "]
[]
[]
[]
[]
[]
[]
[]
[]
[]
[]
[]
[]
{"$rows_left_out":17}
{"sheet":"Vaccination Record","index":1,"n_rows":329,"n_cols":12,"rows_kept":329,"cut":false,"hidden":false,"merged":[[1,10,1,11],[0,9,0,10],[1,0,1,1],[1,2,1,5],[0,6,0,8],[1,6,1,9],[16,0,17,2],[16,3,17,5],[9,4,9,5],[12,0,12,1],[13,0,13,1],[13,4,13,5],[12,4,12,5],[14,0,15,2],[10,0,10,1],[11,0,11,1],[10,2,10,5],[11,2,11,5],[10,6,12,11],[9,0,9,3],[9,8,9,11],[3,6,8,11],[4,0,4,1],[5,0,7,5],[8,4,8,5],[2,2,3,5],[2,0,3,1],[2,6,2,9],[2,10,2,11],[4,2,4,5],[8,0,8,3]]}
["BRUCELLOSIS VACCINATION RECORD",null,null,null,null,null,"Certificate Number: 83-",null,null,{"$f":"K3&\"-\"&D16&E16&F16","v":"-"}]
["Herd Owner: ",null,null,null,null,null,"Veterinarian Name:     ",null,null,null,"Agree Code:"]
["Herd Address:",null,"\n"]
[null,null,null,null,null,null,"I CERTIFY THAT: (1) I have vaccinated with Strain RB51, tattooed and eartagged or otherwise proprely identified all animals listed hereon as prescribed by the Brucellois UM&R, and recorded all information as prescribed by State regulations, (2) when payment is claimed at program expense in accordance with agreement number below no payment has been or will be received from any other source. "]
["Premises ID #:"]
["CERTIFICATION OF OWNER OR WITNESS\nI CERTIFY THAT: the animals listed hereon were vaccinated and identified for the above named owner. "]
[]
[]
["Owner or Witness Name:",null,null,null,"Date:"]
[null,null,null,null,null,null,"Veterinarian Name:     "]
["Vaccine Used",null,"Expiration Date and Serial #",null,null,null,"CERTIFICATION FOR RE-ESTABLISHING VACCINATION STATUS\nIndicate tattoo of animals previously vaccinated in appropriate column.Indicate tattoo of animals previously vaccinated in appropriate column.\n"]
[]
["Dosage",null,"Tattoo",null,"Herd Type:"]
[]
["Date of Vaccination: ",null,null,"(Year)","(Mo)","(Day)"]
[null,null,null,null,null,null,"Date"]
["Total # Vaccinated:",null,null,null,null,null,"CERTIFICATION FOR PAYMENT"]
[]
["#","OFFICIAL ID","AGE (mos)","BREED","SEX","TATTOO","#","OFFICIAL ID","AGE (mos)","BREED","SEX","TATTOO"]
[{"$f":"IF('Data Input'!A2>0,'Data Input'!A2,IF('Data Input'!A2<1,\"\"))","v":""},{"$f":"IF('Data Input'!B2>0,'Data Input'!B2,IF('Data Input'!B2<1,\"\"))","v":""},{"$f":"IF('Data Input'!C2>0,'Data Input'!C2,IF('Data Input'!C2<1,\"\"))","v":""},{"$f":"IF('Data Input'!D2>0,'Data Input'!D2,IF('Data Input'!D2<1,\"\"))","v":""},{"$f":"IF('Data Input'!E2>0,'Data Input'!E2,IF('Data Input'!E2<1,\"\"))","v":""},{"$f":"IF('Data Input'!F2>0,'Data Input'!F2,IF('Data Input'!F2<1,\"\"))","v":""},{"$f":"IF('Data Input'!A33>0,'Data Input'!A33,IF('Data Input'!A33<1,\"\"))","v":""},{"$f":"IF('Data Input'!B33>0,'Data Input'!B33,IF('Data Input'!B33<1,\"\"))","v":""},{"$f":"IF('Data Input'!C33>0,'Data Input'!C33,IF('Data Input'!C33<1,\"\"))","v":""},{"$f":"IF('Data Input'!D33>0,'Data Input'!D33,IF('Data Input'!D33<1,\"\"))","v":""},{"$f":"IF('Data Input'!E33>0,'Data Input'!E33,IF('Data Input'!E33<1,\"\"))","v":""},{"$f":"IF('Data Input'!F33>0,'Data Input'!F33,IF('Data Input'!F33<1,\"\"))","v":""}]
[{"$f":"IF('Data Input'!A3>0,'Data Input'!A3,IF('Data Input'!A3<1,\"\"))","v":""},{"$f":"IF('Data Input'!B3>0,'Data Input'!B3,IF('Data Input'!B3<1,\"\"))","v":""},{"$f":"IF('Data Input'!C3>0,'Data Input'!C3,IF('Data Input'!C3<1,\"\"))","v":""},{"$f":"IF('Data Input'!D3>0,'Data Input'!D3,IF('Data Input'!D3<1,\"\"))","v":""},{"$f":"IF('Data Input'!E3>0,'Data Input'!E3,IF('Data Input'!E3<1,\"\"))","v":""},{"$f":"IF('Data Input'!F3>0,'Data Input'!F3,IF('Data Input'!F3<1,\"\"))","v":""},{"$f":"IF('Data Input'!A34>0,'Data Input'!A34,IF('Data Input'!A34<1,\"\"))","v":""},{"$f":"IF('Data Input'!B34>0,'Data Input'!B34,IF('Data Input'!B34<1,\"\"))","v":""},{"$f":"IF('Data Input'!C34>0,'Data Input'!C34,IF('Data Input'!C34<1,\"\"))","v":""},{"$f":"IF('Data Input'!D34>0,'Data Input'!D34,IF('Data Input'!D34<1,\"\"))","v":""},{"$f":"IF('Data Input'!E34>0,'Data Input'!E34,IF('Data Input'!E34<1,\"\"))","v":""},{"$f":"IF('Data Input'!F34>0,'Data Input'!F34,IF('Data Input'!F34<1,\"\"))","v":""}]
[{"$f":"IF('Data Input'!A4>0,'Data Input'!A4,IF('Data Input'!A4<1,\"\"))","v":""},{"$f":"IF('Data Input'!B4>0,'Data Input'!B4,IF('Data Input'!B4<1,\"\"))","v":""},{"$f":"IF('Data Input'!C4>0,'Data Input'!C4,IF('Data Input'!C4<1,\"\"))","v":""},{"$f":"IF('Data Input'!D4>0,'Data Input'!D4,IF('Data Input'!D4<1,\"\"))","v":""},{"$f":"IF('Data Input'!E4>0,'Data Input'!E4,IF('Data Input'!E4<1,\"\"))","v":""},{"$f":"IF('Data Input'!F4>0,'Data Input'!F4,IF('Data Input'!F4<1,\"\"))","v":""},{"$f":"IF('Data Input'!A35>0,'Data Input'!A35,IF('Data Input'!A35<1,\"\"))","v":""},{"$f":"IF('Data Input'!B35>0,'Data Input'!B35,IF('Data Input'!B35<1,\"\"))","v":""},{"$f":"IF('Data Input'!C35>0,'Data Input'!C35,IF('Data Input'!C35<1,\"\"))","v":""},{"$f":"IF('Data Input'!D35>0,'Data Input'!D35,IF('Data Input'!D35<1,\"\"))","v":""},{"$f":"IF('Data Input'!E35>0,'Data Input'!E35,IF('Data Input'!E35<1,\"\"))","v":""},{"$f":"IF('Data Input'!F35>0,'Data Input'!F35,IF('Data Input'!F35<1,\"\"))","v":""}]
[{"$f":"IF('Data Input'!A5>0,'Data Input'!A5,IF('Data Input'!A5<1,\"\"))","v":""},{"$f":"IF('Data Input'!B5>0,'Data Input'!B5,IF('Data Input'!B5<1,\"\"))","v":""},{"$f":"IF('Data Input'!C5>0,'Data Input'!C5,IF('Data Input'!C5<1,\"\"))","v":""},{"$f":"IF('Data Input'!D5>0,'Data Input'!D5,IF('Data Input'!D5<1,\"\"))","v":""},{"$f":"IF('Data Input'!E5>0,'Data Input'!E5,IF('Data Input'!E5<1,\"\"))","v":""},{"$f":"IF('Data Input'!F5>0,'Data Input'!F5,IF('Data Input'!F5<1,\"\"))","v":""},{"$f":"IF('Data Input'!A36>0,'Data Input'!A36,IF('Data Input'!A36<1,\"\"))","v":""},{"$f":"IF('Data Input'!B36>0,'Data Input'!B36,IF('Data Input'!B36<1,\"\"))","v":""},{"$f":"IF('Data Input'!C36>0,'Data Input'!C36,IF('Data Input'!C36<1,\"\"))","v":""},{"$f":"IF('Data Input'!D36>0,'Data Input'!D36,IF('Data Input'!D36<1,\"\"))","v":""},{"$f":"IF('Data Input'!E36>0,'Data Input'!E36,IF('Data Input'!E36<1,\"\"))","v":""},{"$f":"IF('Data Input'!F36>0,'Data Input'!F36,IF('Data Input'!F36<1,\"\"))","v":""}]
[{"$f":"IF('Data Input'!A6>0,'Data Input'!A6,IF('Data Input'!A6<1,\"\"))","v":""},{"$f":"IF('Data Input'!B6>0,'Data Input'!B6,IF('Data Input'!B6<1,\"\"))","v":""},{"$f":"IF('Data Input'!C6>0,'Data Input'!C6,IF('Data Input'!C6<1,\"\"))","v":""},{"$f":"IF('Data Input'!D6>0,'Data Input'!D6,IF('Data Input'!D6<1,\"\"))","v":""},{"$f":"IF('Data Input'!E6>0,'Data Input'!E6,IF('Data Input'!E6<1,\"\"))","v":""},{"$f":"IF('Data Input'!F6>0,'Data Input'!F6,IF('Data Input'!F6<1,\"\"))","v":""},{"$f":"IF('Data Input'!A37>0,'Data Input'!A37,IF('Data Input'!A37<1,\"\"))","v":""},{"$f":"IF('Data Input'!B37>0,'Data Input'!B37,IF('Data Input'!B37<1,\"\"))","v":""},{"$f":"IF('Data Input'!C37>0,'Data Input'!C37,IF('Data Input'!C37<1,\"\"))","v":""},{"$f":"IF('Data Input'!D37>0,'Data Input'!D37,IF('Data Input'!D37<1,\"\"))","v":""},{"$f":"IF('Data Input'!E37>0,'Data Input'!E37,IF('Data Input'!E37<1,\"\"))","v":""},{"$f":"IF('Data Input'!F37>0,'Data Input'!F37,IF('Data Input'!F37<1,\"\"))","v":""}]
[{"$f":"IF('Data Input'!A7>0,'Data Input'!A7,IF('Data Input'!A7<1,\"\"))","v":""},{"$f":"IF('Data Input'!B7>0,'Data Input'!B7,IF('Data Input'!B7<1,\"\"))","v":""},{"$f":"IF('Data Input'!C7>0,'Data Input'!C7,IF('Data Input'!C7<1,\"\"))","v":""},{"$f":"IF('Data Input'!D7>0,'Data Input'!D7,IF('Data Input'!D7<1,\"\"))","v":""},{"$f":"IF('Data Input'!E7>0,'Data Input'!E7,IF('Data Input'!E7<1,\"\"))","v":""},{"$f":"IF('Data Input'!F7>0,'Data Input'!F7,IF('Data Input'!F7<1,\"\"))","v":""},{"$f":"IF('Data Input'!A38>0,'Data Input'!A38,IF('Data Input'!A38<1,\"\"))","v":""},{"$f":"IF('Data Input'!B38>0,'Data Input'!B38,IF('Data Input'!B38<1,\"\"))","v":""},{"$f":"IF('Data Input'!C38>0,'Data Input'!C38,IF('Data Input'!C38<1,\"\"))","v":""},{"$f":"IF('Data Input'!D38>0,'Data Input'!D38,IF('Data Input'!D38<1,\"\"))","v":""},{"$f":"IF('Data Input'!E38>0,'Data Input'!E38,IF('Data Input'!E38<1,\"\"))","v":""},{"$f":"IF('Data Input'!F38>0,'Data Input'!F38,IF('Data Input'!F38<1,\"\"))","v":""}]
[{"$f":"IF('Data Input'!A8>0,'Data Input'!A8,IF('Data Input'!A8<1,\"\"))","v":""},{"$f":"IF('Data Input'!B8>0,'Data Input'!B8,IF('Data Input'!B8<1,\"\"))","v":""},{"$f":"IF('Data Input'!C8>0,'Data Input'!C8,IF('Data Input'!C8<1,\"\"))","v":""},{"$f":"IF('Data Input'!D8>0,'Data Input'!D8,IF('Data Input'!D8<1,\"\"))","v":""},{"$f":"IF('Data Input'!E8>0,'Data Input'!E8,IF('Data Input'!E8<1,\"\"))","v":""},{"$f":"IF('Data Input'!F8>0,'Data Input'!F8,IF('Data Input'!F8<1,\"\"))","v":""},{"$f":"IF('Data Input'!A39>0,'Data Input'!A39,IF('Data Input'!A39<1,\"\"))","v":""},{"$f":"IF('Data Input'!B39>0,'Data Input'!B39,IF('Data Input'!B39<1,\"\"))","v":""},{"$f":"IF('Data Input'!C39>0,'Data Input'!C39,IF('Data Input'!C39<1,\"\"))","v":""},{"$f":"IF('Data Input'!D39>0,'Data Input'!D39,IF('Data Input'!D39<1,\"\"))","v":""},{"$f":"IF('Data Input'!E39>0,'Data Input'!E39,IF('Data Input'!E39<1,\"\"))","v":""},{"$f":"IF('Data Input'!F39>0,'Data Input'!F39,IF('Data Input'!F39<1,\"\"))","v":""}]
[{"$f":"IF('Data Input'!A9>0,'Data Input'!A9,IF('Data Input'!A9<1,\"\"))","v":""},{"$f":"IF('Data Input'!B9>0,'Data Input'!B9,IF('Data Input'!B9<1,\"\"))","v":""},{"$f":"IF('Data Input'!C9>0,'Data Input'!C9,IF('Data Input'!C9<1,\"\"))","v":""},{"$f":"IF('Data Input'!D9>0,'Data Input'!D9,IF('Data Input'!D9<1,\"\"))","v":""},{"$f":"IF('Data Input'!E9>0,'Data Input'!E9,IF('Data Input'!E9<1,\"\"))","v":""},{"$f":"IF('Data Input'!F9>0,'Data Input'!F9,IF('Data Input'!F9<1,\"\"))","v":""},{"$f":"IF('Data Input'!A40>0,'Data Input'!A40,IF('Data Input'!A40<1,\"\"))","v":""},{"$f":"IF('Data Input'!B40>0,'Data Input'!B40,IF('Data Input'!B40<1,\"\"))","v":""},{"$f":"IF('Data Input'!C40>0,'Data Input'!C40,IF('Data Input'!C40<1,\"\"))","v":""},{"$f":"IF('Data Input'!D40>0,'Data Input'!D40,IF('Data Input'!D40<1,\"\"))","v":""},{"$f":"IF('Data Input'!E40>0,'Data Input'!E40,IF('Data Input'!E40<1,\"\"))","v":""},{"$f":"IF('Data Input'!F40>0,'Data Input'!F40,IF('Data Input'!F40<1,\"\"))","v":""}]
[{"$f":"IF('Data Input'!A10>0,'Data Input'!A10,IF('Data Input'!A10<1,\"\"))","v":""},{"$f":"IF('Data Input'!B10>0,'Data Input'!B10,IF('Data Input'!B10<1,\"\"))","v":""},{"$f":"IF('Data Input'!C10>0,'Data Input'!C10,IF('Data Input'!C10<1,\"\"))","v":""},{"$f":"IF('Data Input'!D10>0,'Data Input'!D10,IF('Data Input'!D10<1,\"\"))","v":""},{"$f":"IF('Data Input'!E10>0,'Data Input'!E10,IF('Data Input'!E10<1,\"\"))","v":""},{"$f":"IF('Data Input'!F10>0,'Data Input'!F10,IF('Data Input'!F10<1,\"\"))","v":""},{"$f":"IF('Data Input'!A41>0,'Data Input'!A41,IF('Data Input'!A41<1,\"\"))","v":""},{"$f":"IF('Data Input'!B41>0,'Data Input'!B41,IF('Data Input'!B41<1,\"\"))","v":""},{"$f":"IF('Data Input'!C41>0,'Data Input'!C41,IF('Data Input'!C41<1,\"\"))","v":""},{"$f":"IF('Data Input'!D41>0,'Data Input'!D41,IF('Data Input'!D41<1,\"\"))","v":""},{"$f":"IF('Data Input'!E41>0,'Data Input'!E41,IF('Data Input'!E41<1,\"\"))","v":""},{"$f":"IF('Data Input'!F41>0,'Data Input'!F41,IF('Data Input'!F41<1,\"\"))","v":""}]
[{"$f":"IF('Data Input'!A11>0,'Data Input'!A11,IF('Data Input'!A11<1,\"\"))","v":""},{"$f":"IF('Data Input'!B11>0,'Data Input'!B11,IF('Data Input'!B11<1,\"\"))","v":""},{"$f":"IF('Data Input'!C11>0,'Data Input'!C11,IF('Data Input'!C11<1,\"\"))","v":""},{"$f":"IF('Data Input'!D11>0,'Data Input'!D11,IF('Data Input'!D11<1,\"\"))","v":""},{"$f":"IF('Data Input'!E11>0,'Data Input'!E11,IF('Data Input'!E11<1,\"\"))","v":""},{"$f":"IF('Data Input'!F11>0,'Data Input'!F11,IF('Data Input'!F11<1,\"\"))","v":""},{"$f":"IF('Data Input'!A42>0,'Data Input'!A42,IF('Data Input'!A42<1,\"\"))","v":""},{"$f":"IF('Data Input'!B42>0,'Data Input'!B42,IF('Data Input'!B42<1,\"\"))","v":""},{"$f":"IF('Data Input'!C42>0,'Data Input'!C42,IF('Data Input'!C42<1,\"\"))","v":""},{"$f":"IF('Data Input'!D42>0,'Data Input'!D42,IF('Data Input'!D42<1,\"\"))","v":""},{"$f":"IF('Data Input'!E42>0,'Data Input'!E42,IF('Data Input'!E42<1,\"\"))","v":""},{"$f":"IF('Data Input'!F42>0,'Data Input'!F42,IF('Data Input'!F42<1,\"\"))","v":""}]
[{"$f":"IF('Data Input'!A12>0,'Data Input'!A12,IF('Data Input'!A12<1,\"\"))","v":""},{"$f":"IF('Data Input'!B12>0,'Data Input'!B12,IF('Data Input'!B12<1,\"\"))","v":""},{"$f":"IF('Data Input'!C12>0,'Data Input'!C12,IF('Data Input'!C12<1,\"\"))","v":""},{"$f":"IF('Data Input'!D12>0,'Data Input'!D12,IF('Data Input'!D12<1,\"\"))","v":""},{"$f":"IF('Data Input'!E12>0,'Data Input'!E12,IF('Data Input'!E12<1,\"\"))","v":""},{"$f":"IF('Data Input'!F12>0,'Data Input'!F12,IF('Data Input'!F12<1,\"\"))","v":""},{"$f":"IF('Data Input'!A43>0,'Data Input'!A43,IF('Data Input'!A43<1,\"\"))","v":""},{"$f":"IF('Data Input'!B43>0,'Data Input'!B43,IF('Data Input'!B43<1,\"\"))","v":""},{"$f":"IF('Data Input'!C43>0,'Data Input'!C43,IF('Data Input'!C43<1,\"\"))","v":""},{"$f":"IF('Data Input'!D43>0,'Data Input'!D43,IF('Data Input'!D43<1,\"\"))","v":""},{"$f":"IF('Data Input'!E43>0,'Data Input'!E43,IF('Data Input'!E43<1,\"\"))","v":""},{"$f":"IF('Data Input'!F43>0,'Data Input'!F43,IF('Data Input'!F43<1,\"\"))","v":""}]
[{"$f":"IF('Data Input'!A13>0,'Data Input'!A13,IF('Data Input'!A13<1,\"\"))","v":""},{"$f":"IF('Data Input'!B13>0,'Data Input'!B13,IF('Data Input'!B13<1,\"\"))","v":""},{"$f":"IF('Data Input'!C13>0,'Data Input'!C13,IF('Data Input'!C13<1,\"\"))","v":""},{"$f":"IF('Data Input'!D13>0,'Data Input'!D13,IF('Data Input'!D13<1,\"\"))","v":""},{"$f":"IF('Data Input'!E13>0,'Data Input'!E13,IF('Data Input'!E13<1,\"\"))","v":""},{"$f":"IF('Data Input'!F13>0,'Data Input'!F13,IF('Data Input'!F13<1,\"\"))","v":""},{"$f":"IF('Data Input'!A44>0,'Data Input'!A44,IF('Data Input'!A44<1,\"\"))","v":""},{"$f":"IF('Data Input'!B44>0,'Data Input'!B44,IF('Data Input'!B44<1,\"\"))","v":""},{"$f":"IF('Data Input'!C44>0,'Data Input'!C44,IF('Data Input'!C44<1,\"\"))","v":""},{"$f":"IF('Data Input'!D44>0,'Data Input'!D44,IF('Data Input'!D44<1,\"\"))","v":""},{"$f":"IF('Data Input'!E44>0,'Data Input'!E44,IF('Data Input'!E44<1,\"\"))","v":""},{"$f":"IF('Data Input'!F44>0,'Data Input'!F44,IF('Data Input'!F44<1,\"\"))","v":""}]
[{"$f":"IF('Data Input'!A14>0,'Data Input'!A14,IF('Data Input'!A14<1,\"\"))","v":""},{"$f":"IF('Data Input'!B14>0,'Data Input'!B14,IF('Data Input'!B14<1,\"\"))","v":""},{"$f":"IF('Data Input'!C14>0,'Data Input'!C14,IF('Data Input'!C14<1,\"\"))","v":""},{"$f":"IF('Data Input'!D14>0,'Data Input'!D14,IF('Data Input'!D14<1,\"\"))","v":""},{"$f":"IF('Data Input'!E14>0,'Data Input'!E14,IF('Data Input'!E14<1,\"\"))","v":""},{"$f":"IF('Data Input'!F14>0,'Data Input'!F14,IF('Data Input'!F14<1,\"\"))","v":""},{"$f":"IF('Data Input'!A45>0,'Data Input'!A45,IF('Data Input'!A45<1,\"\"))","v":""},{"$f":"IF('Data Input'!B45>0,'Data Input'!B45,IF('Data Input'!B45<1,\"\"))","v":""},{"$f":"IF('Data Input'!C45>0,'Data Input'!C45,IF('Data Input'!C45<1,\"\"))","v":""},{"$f":"IF('Data Input'!D45>0,'Data Input'!D45,IF('Data Input'!D45<1,\"\"))","v":""},{"$f":"IF('Data Input'!E45>0,'Data Input'!E45,IF('Data Input'!E45<1,\"\"))","v":""},{"$f":"IF('Data Input'!F45>0,'Data Input'!F45,IF('Data Input'!F45<1,\"\"))","v":""}]
[{"$f":"IF('Data Input'!A15>0,'Data Input'!A15,IF('Data Input'!A15<1,\"\"))","v":""},{"$f":"IF('Data Input'!B15>0,'Data Input'!B15,IF('Data Input'!B15<1,\"\"))","v":""},{"$f":"IF('Data Input'!C15>0,'Data Input'!C15,IF('Data Input'!C15<1,\"\"))","v":""},{"$f":"IF('Data Input'!D15>0,'Data Input'!D15,IF('Data Input'!D15<1,\"\"))","v":""},{"$f":"IF('Data Input'!E15>0,'Data Input'!E15,IF('Data Input'!E15<1,\"\"))","v":""},{"$f":"IF('Data Input'!F15>0,'Data Input'!F15,IF('Data Input'!F15<1,\"\"))","v":""},{"$f":"IF('Data Input'!A46>0,'Data Input'!A46,IF('Data Input'!A46<1,\"\"))","v":""},{"$f":"IF('Data Input'!B46>0,'Data Input'!B46,IF('Data Input'!B46<1,\"\"))","v":""},{"$f":"IF('Data Input'!C46>0,'Data Input'!C46,IF('Data Input'!C46<1,\"\"))","v":""},{"$f":"IF('Data Input'!D46>0,'Data Input'!D46,IF('Data Input'!D46<1,\"\"))","v":""},{"$f":"IF('Data Input'!E46>0,'Data Input'!E46,IF('Data Input'!E46<1,\"\"))","v":""},{"$f":"IF('Data Input'!F46>0,'Data Input'!F46,IF('Data Input'!F46<1,\"\"))","v":""}]
[{"$f":"IF('Data Input'!A16>0,'Data Input'!A16,IF('Data Input'!A16<1,\"\"))","v":""},{"$f":"IF('Data Input'!B16>0,'Data Input'!B16,IF('Data Input'!B16<1,\"\"))","v":""},{"$f":"IF('Data Input'!C16>0,'Data Input'!C16,IF('Data Input'!C16<1,\"\"))","v":""},{"$f":"IF('Data Input'!D16>0,'Data Input'!D16,IF('Data Input'!D16<1,\"\"))","v":""},{"$f":"IF('Data Input'!E16>0,'Data Input'!E16,IF('Data Input'!E16<1,\"\"))","v":""},{"$f":"IF('Data Input'!F16>0,'Data Input'!F16,IF('Data Input'!F16<1,\"\"))","v":""},{"$f":"IF('Data Input'!A47>0,'Data Input'!A47,IF('Data Input'!A47<1,\"\"))","v":""},{"$f":"IF('Data Input'!B47>0,'Data Input'!B47,IF('Data Input'!B47<1,\"\"))","v":""},{"$f":"IF('Data Input'!C47>0,'Data Input'!C47,IF('Data Input'!C47<1,\"\"))","v":""},{"$f":"IF('Data Input'!D47>0,'Data Input'!D47,IF('Data Input'!D47<1,\"\"))","v":""},{"$f":"IF('Data Input'!E47>0,'Data Input'!E47,IF('Data Input'!E47<1,\"\"))","v":""},{"$f":"IF('Data Input'!F47>0,'Data Input'!F47,IF('Data Input'!F47<1,\"\"))","v":""}]
[{"$f":"IF('Data Input'!A17>0,'Data Input'!A17,IF('Data Input'!A17<1,\"\"))","v":""},{"$f":"IF('Data Input'!B17>0,'Data Input'!B17,IF('Data Input'!B17<1,\"\"))","v":""},{"$f":"IF('Data Input'!C17>0,'Data Input'!C17,IF('Data Input'!C17<1,\"\"))","v":""},{"$f":"IF('Data Input'!D17>0,'Data Input'!D17,IF('Data Input'!D17<1,\"\"))","v":""},{"$f":"IF('Data Input'!E17>0,'Data Input'!E17,IF('Data Input'!E17<1,\"\"))","v":""},{"$f":"IF('Data Input'!F17>0,'Data Input'!F17,IF('Data Input'!F17<1,\"\"))","v":""},{"$f":"IF('Data Input'!A48>0,'Data Input'!A48,IF('Data Input'!A48<1,\"\"))","v":""},{"$f":"IF('Data Input'!B48>0,'Data Input'!B48,IF('Data Input'!B48<1,\"\"))","v":""},{"$f":"IF('Data Input'!C48>0,'Data Input'!C48,IF('Data Input'!C48<1,\"\"))","v":""},{"$f":"IF('Data Input'!D48>0,'Data Input'!D48,IF('Data Input'!D48<1,\"\"))","v":""},{"$f":"IF('Data Input'!E48>0,'Data Input'!E48,IF('Data Input'!E48<1,\"\"))","v":""},{"$f":"IF('Data Input'!F48>0,'Data Input'!F48,IF('Data Input'!F48<1,\"\"))","v":""}]
[{"$f":"IF('Data Input'!A18>0,'Data Input'!A18,IF('Data Input'!A18<1,\"\"))","v":""},{"$f":"IF('Data Input'!B18>0,'Data Input'!B18,IF('Data Input'!B18<1,\"\"))","v":""},{"$f":"IF('Data Input'!C18>0,'Data Input'!C18,IF('Data Input'!C18<1,\"\"))","v":""},{"$f":"IF('Data Input'!D18>0,'Data Input'!D18,IF('Data Input'!D18<1,\"\"))","v":""},{"$f":"IF('Data Input'!E18>0,'Data Input'!E18,IF('Data Input'!E18<1,\"\"))","v":""},{"$f":"IF('Data Input'!F18>0,'Data Input'!F18,IF('Data Input'!F18<1,\"\"))","v":""},{"$f":"IF('Data Input'!A49>0,'Data Input'!A49,IF('Data Input'!A49<1,\"\"))","v":""},{"$f":"IF('Data Input'!B49>0,'Data Input'!B49,IF('Data Input'!B49<1,\"\"))","v":""},{"$f":"IF('Data Input'!C49>0,'Data Input'!C49,IF('Data Input'!C49<1,\"\"))","v":""},{"$f":"IF('Data Input'!D49>0,'Data Input'!D49,IF('Data Input'!D49<1,\"\"))","v":""},{"$f":"IF('Data Input'!E49>0,'Data Input'!E49,IF('Data Input'!E49<1,\"\"))","v":""},{"$f":"IF('Data Input'!F49>0,'Data Input'!F49,IF('Data Input'!F49<1,\"\"))","v":""}]
[{"$f":"IF('Data Input'!A19>0,'Data Input'!A19,IF('Data Input'!A19<1,\"\"))","v":""},{"$f":"IF('Data Input'!B19>0,'Data Input'!B19,IF('Data Input'!B19<1,\"\"))","v":""},{"$f":"IF('Data Input'!C19>0,'Data Input'!C19,IF('Data Input'!C19<1,\"\"))","v":""},{"$f":"IF('Data Input'!D19>0,'Data Input'!D19,IF('Data Input'!D19<1,\"\"))","v":""},{"$f":"IF('Data Input'!E19>0,'Data Input'!E19,IF('Data Input'!E19<1,\"\"))","v":""},{"$f":"IF('Data Input'!F19>0,'Data Input'!F19,IF('Data Input'!F19<1,\"\"))","v":""},{"$f":"IF('Data Input'!A50>0,'Data Input'!A50,IF('Data Input'!A50<1,\"\"))","v":""},{"$f":"IF('Data Input'!B50>0,'Data Input'!B50,IF('Data Input'!B50<1,\"\"))","v":""},{"$f":"IF('Data Input'!C50>0,'Data Input'!C50,IF('Data Input'!C50<1,\"\"))","v":""},{"$f":"IF('Data Input'!D50>0,'Data Input'!D50,IF('Data Input'!D50<1,\"\"))","v":""},{"$f":"IF('Data Input'!E50>0,'Data Input'!E50,IF('Data Input'!E50<1,\"\"))","v":""},{"$f":"IF('Data Input'!F50>0,'Data Input'!F50,IF('Data Input'!F50<1,\"\"))","v":""}]
[{"$f":"IF('Data Input'!A20>0,'Data Input'!A20,IF('Data Input'!A20<1,\"\"))","v":""},{"$f":"IF('Data Input'!B20>0,'Data Input'!B20,IF('Data Input'!B20<1,\"\"))","v":""},{"$f":"IF('Data Input'!C20>0,'Data Input'!C20,IF('Data Input'!C20<1,\"\"))","v":""},{"$f":"IF('Data Input'!D20>0,'Data Input'!D20,IF('Data Input'!D20<1,\"\"))","v":""},{"$f":"IF('Data Input'!E20>0,'Data Input'!E20,IF('Data Input'!E20<1,\"\"))","v":""},{"$f":"IF('Data Input'!F20>0,'Data Input'!F20,IF('Data Input'!F20<1,\"\"))","v":""},{"$f":"IF('Data Input'!A51>0,'Data Input'!A51,IF('Data Input'!A51<1,\"\"))","v":""},{"$f":"IF('Data Input'!B51>0,'Data Input'!B51,IF('Data Input'!B51<1,\"\"))","v":""},{"$f":"IF('Data Input'!C51>0,'Data Input'!C51,IF('Data Input'!C51<1,\"\"))","v":""},{"$f":"IF('Data Input'!D51>0,'Data Input'!D51,IF('Data Input'!D51<1,\"\"))","v":""},{"$f":"IF('Data Input'!E51>0,'Data Input'!E51,IF('Data Input'!E51<1,\"\"))","v":""},{"$f":"IF('Data Input'!F51>0,'Data Input'!F51,IF('Data Input'!F51<1,\"\"))","v":""}]
[{"$f":"IF('Data Input'!A21>0,'Data Input'!A21,IF('Data Input'!A21<1,\"\"))","v":""},{"$f":"IF('Data Input'!B21>0,'Data Input'!B21,IF('Data Input'!B21<1,\"\"))","v":""},{"$f":"IF('Data Input'!C21>0,'Data Input'!C21,IF('Data Input'!C21<1,\"\"))","v":""},{"$f":"IF('Data Input'!D21>0,'Data Input'!D21,IF('Data Input'!D21<1,\"\"))","v":""},{"$f":"IF('Data Input'!E21>0,'Data Input'!E21,IF('Data Input'!E21<1,\"\"))","v":""},{"$f":"IF('Data Input'!F21>0,'Data Input'!F21,IF('Data Input'!F21<1,\"\"))","v":""},{"$f":"IF('Data Input'!A52>0,'Data Input'!A52,IF('Data Input'!A52<1,\"\"))","v":""},{"$f":"IF('Data Input'!B52>0,'Data Input'!B52,IF('Data Input'!B52<1,\"\"))","v":""},{"$f":"IF('Data Input'!C52>0,'Data Input'!C52,IF('Data Input'!C52<1,\"\"))","v":""},{"$f":"IF('Data Input'!D52>0,'Data Input'!D52,IF('Data Input'!D52<1,\"\"))","v":""},{"$f":"IF('Data Input'!E52>0,'Data Input'!E52,IF('Data Input'!E52<1,\"\"))","v":""},{"$f":"IF('Data Input'!F52>0,'Data Input'!F52,IF('Data Input'!F52<1,\"\"))","v":""}]
[{"$f":"IF('Data Input'!A22>0,'Data Input'!A22,IF('Data Input'!A22<1,\"\"))","v":""},{"$f":"IF('Data Input'!B22>0,'Data Input'!B22,IF('Data Input'!B22<1,\"\"))","v":""},{"$f":"IF('Data Input'!C22>0,'Data Input'!C22,IF('Data Input'!C22<1,\"\"))","v":""},{"$f":"IF('Data Input'!D22>0,'Data Input'!D22,IF('Data Input'!D22<1,\"\"))","v":""},{"$f":"IF('Data Input'!E22>0,'Data Input'!E22,IF('Data Input'!E22<1,\"\"))","v":""},{"$f":"IF('Data Input'!F22>0,'Data Input'!F22,IF('Data Input'!F22<1,\"\"))","v":""},{"$f":"IF('Data Input'!A53>0,'Data Input'!A53,IF('Data Input'!A53<1,\"\"))","v":""},{"$f":"IF('Data Input'!B53>0,'Data Input'!B53,IF('Data Input'!B53<1,\"\"))","v":""},{"$f":"IF('Data Input'!C53>0,'Data Input'!C53,IF('Data Input'!C53<1,\"\"))","v":""},{"$f":"IF('Data Input'!D53>0,'Data Input'!D53,IF('Data Input'!D53<1,\"\"))","v":""},{"$f":"IF('Data Input'!E53>0,'Data Input'!E53,IF('Data Input'!E53<1,\"\"))","v":""},{"$f":"IF('Data Input'!F53>0,'Data Input'!F53,IF('Data Input'!F53<1,\"\"))","v":""}]
{"$rows_left_out":290}
{"sheet":"Data Input","index":2,"n_rows":623,"n_cols":6,"rows_kept":623,"cut":false,"hidden":false,"merged":[[622,0,626,6]]}
["#","OFFICIAL ID","AGE (mos)","Breed","Sex","Tattoo"]
[]
[]
[]
[]
[]
[]
[]
[]
[]
[]
[]
[]
[]
[]
[]
[]
[]
[]
[]
[]
[]
[]
[]
[]
[]
[]
[]
[]
[]
[]
[]
[]
[]
[]
[]
[]
[]
[]
[]
{"$rows_left_out":584}
{"sheet":"Drop Down Source","index":3,"n_rows":8,"n_cols":1,"rows_kept":8,"cut":false,"hidden":true,"merged":[]}
["(SELECT)"]
["BEEF"]
["DAIRY"]
["MIXED"]
["BISON"]
[]
[]
["Sheet Protection Password: eOCV"]